{"text_format":"1","workbook":"xlsx","n_sheets":12,"sheets":["Leaderboard","August","September","October","November","December","January","February","March","April","May","Jokers"],"not_rendered":{"charts":0,"images":6,"macros":1,"external_links":0,"defined_names":0,"comments":0,"pivot_tables":0},"unopened":[],"bounds":{"document_bytes":16777216,"sheet_cells":100000,"rows_first":2000,"rows_last":500,"rows_between":2000,"halvings":0,"cell_chars":16384,"cell_head_chars":4096},"cells_cut":0,"cells_raw":0,"read":"whole","date_system":"1900"}

{"sheet":"Leaderboard","index":0,"n_rows":105,"n_cols":14,"rows_kept":105,"cut":false,"hidden":false,"merged":[]}
[]
[]
[]
[]
["No.","Name","Team","2025-08-01","2025-09-01","2025-10-01","2025-11-01","2025-12-01","2026-01-01","2026-02-01","2026-03-01","2026-04-01","2026-05-01","Total"]
[1,"Chris Keohan","Nancy's Warriors",{"$f":"HLOOKUP(B6,August!$H$1:$DC$73,73,FALSE)","v":105},{"$f":"HLOOKUP(B6,September!$H$1:$DC$73,73,FALSE)","v":112},{"$f":"HLOOKUP(B6,October!$H$1:$DC$51,51,FALSE)","v":109},{"$f":"HLOOKUP(B6,November!$H$1:$DC$61,61,FALSE)","v":160},{"$f":"HLOOKUP(B6,December!$H$1:$DC$81,81,FALSE)","v":113},null,null,null,null,null,{"$f":"SUM(D6:M6)","v":599}]
[2,"Helen Fadian","Keelwestkats",{"$f":"HLOOKUP(B7,August!$H$1:$DC$73,73,FALSE)","v":105},{"$f":"HLOOKUP(B7,September!$H$1:$DC$73,73,FALSE)","v":99},{"$f":"HLOOKUP(B7,October!$H$1:$DC$51,51,FALSE)","v":106},{"$f":"HLOOKUP(B7,November!$H$1:$DC$61,61,FALSE)","v":141},{"$f":"HLOOKUP(B7,December!$H$1:$DC$81,81,FALSE)","v":121},null,null,null,null,null,{"$f":"SUM(D7:M7)","v":572}]
[3,"Jason Maloney","Time Out Hoops",{"$f":"HLOOKUP(B8,August!$H$1:$DC$73,73,FALSE)","v":108},{"$f":"HLOOKUP(B8,September!$H$1:$DC$73,73,FALSE)","v":104},{"$f":"HLOOKUP(B8,October!$H$1:$DC$51,51,FALSE)","v":108},{"$f":"HLOOKUP(B8,November!$H$1:$DC$61,61,FALSE)","v":138},{"$f":"HLOOKUP(B8,December!$H$1:$DC$81,81,FALSE)","v":113},null,null,null,null,null,{"$f":"SUM(D8:M8)","v":571}]
{"$rows_left_out":98}
{"sheet":"August","index":1,"n_rows":73,"n_cols":107,"rows_kept":73,"cut":false,"hidden":false,"merged":[[1,1,1,4]]}
[null,null,null,null,null,null,null,"Aaron Nealon","Aidan Scanlon","Aidan White","Alain Verjans","Anastas Popov","Andy Dunne","Benny McCarthy","Billy McGinley","Bobby Hynes","Brendan Maguire","Brian Haughton","Brian Hearne","Brian Mullen","Calvin McGettigan","Caoimhin McEnteggart","Carl Toner","Caroline Carroll","Chris Keohan","Christina Morgan","Ciaran O'Hart","Colin Butterly","Con McSweeney","Craig Calvert","Craig Whelan","Daniel Dorrian","Darragh Kenny","Darren O'Gorman","Dave Lavelle","Dave McGinley","David Cooney","David Doyle","David King","Derek McDonald","Dylan Delaney","Dylan O'Riordan","Eamon Fox","Eamonn Gallagher","Eoghan Farrelly","Finbarr Corkery","Frank McSweeney","Gareth Pierpoint","Gary Donnelly","Gary Fitzpatrick","Gavin Goodwin","Gavin Morgan","Gerry Draper","Gerry Moore","Graham Pierpoint","Greg Donaghy","Helen Fadian","Jack Draper","Jason Maloney","Javier Suarez","Jim Foley","Jimmy Maguire","Joe Behan","Joe Turner","John Brophy","John Cafferkey","Johno Percy","Jonathan Fox","Joseph Kavanagh","Joseph Leppla","Keith Nerney","Keith Ryan","Kev Dalton","Kevin Lawless","Kevin Nolan","Kieran Killeen","Liam Keohan","Lionel Knott","Martin Kimmins","Micheal Joyce","Micheal Munnelly","Monica Collins","Niall Carroll","Paddy Devereux","Paul Foley","Paul Moore","Paul Prendergast","Peter Lavelle","Phil Doyle","Philip Jordan","Phoebe Suarez Behan","Realtin Dunne","Rhea Suarez Behan","Richard Johnston","Robert Foley","Robert Gaffney","Roisin Joyce","Sam Calvert","Sean Cafferkey","Sean Cleary","Sean O'Mairtin","Shane Horan","Simon Scanlon","Thomas Nolan","Tommy Hamill","Tommy Tormey","Tommy Walsh"]
["Date","Teams",null,null,null,"Time"]
["2025-08-15","Liverpool",4,2,"Bournemouth",45884.833333333336,null,5,5,5,5,5,5,0,5,5,5,5,5,5,5,5,5,5,5,5,5,"-",5,5,5,5,5,5,5,5,5,5,5,5,5,5,5,5,5,5,5,5,5,5,5,5,5,5,5,5,5,5,5,5,5,"-",5,5,5,5,5,5,5,5,5,5,5,5,5,5,5,5,5,5,5,5,5,5,5,5,5,5,5,5,5,5,5,5,5,5,5,0,5,5,5,5,5,5,5,5,5]
["2025-08-16","Aston Villa",0,0,"Newcastle",45885.520833333336,null,5,5,0,5,5,0,5,5,5,5,0,5,0,0,5,5,0,0,0,5,"-",5,0,5,5,5,0,0,5,0,0,5,5,0,0,0,0,0,5,0,5,5,5,0,5,0,5,5,0,5,0,5,0,0,"-",0,0,5,0,0,0,0,0,0,5,0,0,5,5,0,0,5,5,5,0,0,0,0,5,0,5,0,5,0,0,0,0,5,0,0,0,0,0,0,5,5,5,5,0,5]
["2025-08-16","Brighton",1,1,"Fulham",45885.625,null,0,0,10,0,0,0,5,0,10,0,0,0,10,0,10,0,0,0,0,0,"-",5,10,10,0,10,0,0,0,5,0,5,0,0,0,0,0,0,10,0,0,0,5,10,0,0,10,0,10,0,0,5,0,5,"-",0,0,0,10,5,0,10,0,0,0,0,10,0,5,0,0,0,0,0,0,10,0,5,0,0,0,10,0,0,0,0,10,0,10,0,5,0,0,0,0,0,0,0,0,0]
["2025-08-16","Spurs",3,0,"Burnley",45885.625,null,5,5,5,5,5,5,10,5,5,5,10,5,5,5,5,5,10,5,5,5,"-",5,5,5,10,5,10,5,5,5,10,5,5,5,5,10,5,5,5,5,5,5,5,5,5,5,5,5,5,5,5,5,5,5,"-",10,5,10,5,5,5,10,5,5,5,10,5,5,5,5,5,0,0,5,5,5,5,5,5,5,5,0,5,5,5,5,5,5,5,5,5,5,10,5,10,5,5,5,5,5]
["2025-08-16","Sunderland",3,0,"West Ham",45885.625,null,5,0,5,0,0,0,0,0,5,0,0,0,0,0,0,0,0,0,5,0,"-",0,0,0,0,0,0,0,0,0,0,0,0,0,0,0,0,0,0,0,0,5,5,0,0,5,0,0,0,0,0,0,0,0,"-",0,5,5,0,0,0,0,0,0,0,0,0,0,0,0,0,5,0,0,0,5,0,0,0,0,0,0,0,0,0,0,0,0,0,5,0,0,0,0,0,0,0,0,5,0]
["2025-08-16","Wolves",0,4,"Man City",45885.729166666664,null,5,5,5,5,5,5,10,5,5,5,5,5,5,5,5,5,5,5,0,5,"-",5,5,5,5,5,5,5,5,5,5,5,5,5,5,5,5,5,5,5,5,5,5,5,5,0,5,5,5,5,5,5,5,5,"-",5,5,5,5,5,5,5,5,5,5,5,5,5,5,5,0,5,5,5,5,5,5,5,5,5,10,5,5,5,5,5,5,5,5,5,5,5,5,5,5,5,5,5,5,5]
{"$rows_left_out":66}
{"sheet":"September","index":2,"n_rows":73,"n_cols":107,"rows_kept":73,"cut":false,"hidden":false,"merged":[[1,1,1,4]]}
[null,null,null,null,null,null,null,"Aaron Nealon","Aidan Scanlon","Aidan White","Alain Verjans","Anastas Popov","Andy Dunne","Benny McCarthy","Billy McGinley","Bobby Hynes","Brendan Maguire","Brian Haughton","Brian Hearne","Brian Mullen","Calvin McGettigan","Caoimhin McEnteggart","Carl Toner","Caroline Carroll","Chris Keohan","Christina Morgan","Ciaran O'Hart","Colin Butterly","Con McSweeney","Craig Calvert","Craig Whelan","Daniel Dorrian","Darragh Kenny","Darren O'Gorman","Dave Lavelle","Dave McGinley","David Cooney","David Doyle","David King","Derek McDonald","Dylan Delaney","Dylan O'Riordan","Eamon Fox","Eamonn Gallagher","Eoghan Farrelly","Finbarr Corkery","Frank McSweeney","Gareth Pierpoint","Gary Donnelly","Gary Fitzpatrick","Gavin Goodwin","Gavin Morgan","Gerry Draper","Gerry Moore","Graham Pierpoint","Greg Donaghy","Helen Fadian","Jack Draper","Jason Maloney","Javier Suarez","Jim Foley","Jimmy Maguire","Joe Behan","Joe Turner","John Brophy","John Cafferkey","Johno Percy","Jonathan Fox","Joseph Kavanagh","Joseph Leppla","Keith Nerney","Keith Ryan","Kev Dalton","Kevin Lawless","Kevin Nolan","Kieran Killeen","Liam Keohan","Lionel Knott","Martin Kimmins","Micheal Joyce","Micheal Munnelly","Monica Collins","Niall Carroll","Paddy Devereux","Paul Foley","Paul Moore","Paul Prendergast","Peter Lavelle","Phil Doyle","Philip Jordan","Phoebe Suarez Behan","Realtin Dunne","Rhea Suarez Behan","Richard Johnston","Robert Foley","Robert Gaffney","Roisin Joyce","Sam Calvert","Sean Cafferkey","Sean Cleary","Sean O'Mairtin","Shane Horan","Simon Scanlon","Thomas Nolan","Tommy Hamill","Tommy Tormey","Tommy Walsh"]
["Date","Teams",null,null,null,"Time"]
["2025-09-13","Arsenal",3,0,"Nott'm Forest","12:30:00",null,5,5,5,5,5,5,5,5,5,10,10,5,5,0,5,5,10,5,5,5,5,5,5,5,5,5,10,5,5,5,5,5,5,5,5,5,5,5,5,5,5,5,5,5,10,5,10,5,10,5,5,5,5,10,5,5,5,5,10,5,5,5,5,5,5,10,10,5,10,5,5,5,5,5,5,5,5,10,5,5,5,5,5,10,5,5,5,5,5,5,5,5,5,5,5,0,5,5,0,5]
["2025-09-13","Bournemouth",2,1,"Brighton",45913.625,null,0,0,5,10,0,0,10,0,0,0,10,0,0,0,0,0,10,10,10,0,10,10,10,10,10,0,10,5,0,0,10,0,0,0,0,0,0,0,0,10,0,5,0,10,10,5,0,10,10,5,0,10,0,0,0,0,5,0,0,10,5,10,10,10,0,10,10,0,0,10,10,10,0,0,10,0,5,5,0,10,0,0,0,0,10,0,10,0,10,5,0,0,10,0,0,0,10,0,0,10]
["2025-09-13","Crystal Palace",0,0,"Sunderland",45913.625,null,0,0,5,0,0,0,0,0,0,0,0,0,0,10,0,0,0,5,0,0,0,0,0,0,0,0,0,0,0,0,0,0,0,0,0,0,0,0,0,0,0,0,0,0,0,0,5,0,0,0,0,0,0,0,0,0,0,0,0,0,0,0,0,0,0,0,0,0,0,0,0,0,0,0,5,5,0,0,0,0,0,0,0,0,0,5,5,0,0,0,0,0,0,0,0,5,0,0,0,0]
["2025-09-13","Everton",0,0,"Aston Villa",45913.625,null,5,0,5,5,0,5,0,0,5,0,5,0,0,10,0,5,0,0,0,0,0,0,0,5,0,5,0,0,5,5,0,0,5,0,0,0,5,0,0,5,0,5,5,5,0,0,5,5,0,0,0,5,0,5,5,0,0,0,0,0,0,5,5,0,0,0,0,0,0,0,0,5,0,0,5,0,5,0,5,5,5,5,0,5,0,5,0,5,5,0,0,0,5,5,0,5,0,5,0,0]
["2025-09-13","Fulham",1,0,"Leeds Utd",45913.625,null,5,5,0,10,5,10,5,5,5,5,5,0,0,0,0,10,5,5,5,0,5,5,5,5,5,5,0,5,10,10,5,0,0,5,0,5,10,0,5,5,5,0,5,5,10,5,10,5,5,10,0,5,0,5,0,5,10,5,5,5,10,5,5,10,0,0,5,5,10,10,0,10,0,0,5,5,0,5,5,10,5,0,5,0,5,5,0,5,5,0,10,5,5,5,10,0,0,5,5,0]
["2025-09-13","Newcastle",1,0,"Wolves",45913.625,null,5,5,5,5,5,5,5,5,5,5,5,5,5,0,0,5,5,5,5,5,5,5,5,5,5,5,5,5,5,5,5,5,5,5,5,5,5,5,5,5,5,5,5,5,5,5,5,5,5,5,5,5,5,5,5,5,5,5,5,5,10,5,5,5,5,5,5,5,5,5,5,5,5,5,5,5,10,5,5,5,5,5,5,5,5,5,0,5,5,5,5,5,5,5,5,0,5,5,5,5]
{"$rows_left_out":66}
{"sheet":"October","index":3,"n_rows":51,"n_cols":107,"rows_kept":51,"cut":false,"hidden":false,"merged":[[1,1,1,4]]}
[null,null,null,null,null,null,null,"Aaron Nealon","Aidan Scanlon","Aidan White","Alain Verjans","Anastas Popov","Andy Dunne","Benny McCarthy","Billy McGinley","Bobby Hynes","Brendan Maguire","Brian Haughton","Brian Hearne","Brian Mullen","Calvin McGettigan","Caoimhin McEnteggart","Carl Toner","Caroline Carroll","Chris Keohan","Christina Morgan","Ciaran O'Hart","Colin Butterly","Con McSweeney","Craig Calvert","Craig Whelan","Daniel Dorrian","Darragh Kenny","Darren O'Gorman","Dave Lavelle","Dave McGinley","David Cooney","David Doyle","David King","Derek McDonald","Dylan Delaney","Dylan O'Riordan","Eamon Fox","Eamonn Gallagher","Eoghan Farrelly","Finbarr Corkery","Frank McSweeney","Gareth Pierpoint","Gary Donnelly","Gary Fitzpatrick","Gavin Goodwin","Gavin Morgan","Gerry Draper","Gerry Moore","Graham Pierpoint","Greg Donaghy","Helen Fadian","Jack Draper","Jason Maloney","Javier Suarez","Jim Foley","Jimmy Maguire","Joe Behan","Joe Turner","John Brophy","John Cafferkey","Johno Percy","Jonathan Fox","Joseph Kavanagh","Joseph Leppla","Keith Nerney","Keith Ryan","Kev Dalton","Kevin Lawless","Kevin Nolan","Kieran Killeen","Liam Keohan","Lionel Knott","Martin Kimmins","Micheal Joyce","Micheal Munnelly","Monica Collins","Niall Carroll","Paddy Devereux","Paul Foley","Paul Moore","Paul Prendergast","Peter Lavelle","Phil Doyle","Philip Jordan","Phoebe Suarez Behan","Realtin Dunne","Rhea Suarez Behan","Richard Johnston","Robert Foley","Robert Gaffney","Roisin Joyce","Sam Calvert","Sean Cafferkey","Sean Cleary","Sean O'Mairtin","Shane Horan","Simon Scanlon","Thomas Nolan","Tommy Hamill","Tommy Tormey","Tommy Walsh"]
["Date","Teams",null,null,null,"Time"]
["2025-10-03","Bournemouth",3,1,"Fulham","20:00:00",null,5,5,5,5,5,5,5,0,5,5,5,5,0,"-",0,0,5,5,5,0,5,5,5,5,5,5,5,"-",5,5,5,5,5,5,0,5,5,5,5,5,5,5,5,5,5,5,5,5,5,5,5,5,5,5,0,0,5,5,5,10,5,5,5,5,5,5,10,5,0,5,5,5,0,5,5,5,5,5,5,5,5,5,5,5,5,0,5,5,5,5,5,5,5,5,5,0,0,5,5,5]
["2025-10-04","Leeds Utd",1,2,"Spurs","12:30:00",null,5,5,10,0,5,5,0,5,0,0,5,0,10,"-",0,5,10,10,0,0,0,10,0,10,0,5,0,"-",0,5,0,10,10,0,10,0,0,10,5,5,5,0,0,0,0,0,10,0,5,10,5,10,5,10,10,0,10,5,5,0,10,5,10,0,0,10,0,5,5,10,0,0,0,5,10,0,10,5,0,0,10,0,10,0,10,5,10,10,10,10,5,10,5,0,0,0,10,10,5,0]
["2025-10-04","Arsenal",2,0,"West Ham",45934.625,null,10,10,10,10,10,5,0,5,10,5,5,10,10,"-",10,10,5,5,5,0,5,5,10,10,10,5,5,"-",10,10,5,10,5,5,10,5,5,10,10,5,5,5,5,5,5,10,5,5,10,5,10,5,5,5,5,10,5,5,5,10,5,10,5,5,5,5,5,5,5,5,10,5,5,5,10,10,5,5,5,5,5,10,10,5,10,10,5,5,5,5,5,5,5,10,5,5,5,10,0,5]
["2025-10-04","Man Utd",2,0,"Sunderland",45934.625,null,0,5,0,5,0,5,0,0,10,5,10,5,5,"-",0,5,0,5,5,0,5,10,5,10,10,5,5,"-",5,0,0,0,5,5,5,5,10,5,0,10,5,5,0,5,0,5,0,5,5,10,5,5,0,0,0,0,5,0,5,5,10,5,5,5,10,10,5,10,0,10,10,0,0,0,5,0,5,0,5,5,10,5,5,0,0,5,0,5,0,5,5,5,5,10,5,5,10,0,5,5]
["2025-10-04","Chelsea",2,1,"Liverpool","17:30:00",null,0,0,0,0,0,0,0,0,0,0,0,0,0,"-",0,0,0,0,10,0,0,0,0,0,5,0,0,"-",0,0,0,10,0,10,0,0,0,0,0,0,0,0,0,10,0,0,0,0,0,0,0,0,0,0,0,0,10,0,0,0,0,0,0,0,0,10,0,10,0,0,0,0,10,0,0,0,0,0,0,0,0,0,0,0,0,0,0,0,0,0,0,0,0,0,0,10,0,5,5,10]
["2025-10-05","Aston Villa",2,1,"Burnley","14:00:00",null,0,5,5,5,10,10,0,5,5,5,5,5,10,"-",0,5,5,5,10,0,10,0,5,5,5,5,5,"-",5,5,5,0,5,10,0,10,5,5,5,5,5,10,10,10,5,10,5,5,5,5,10,5,5,10,5,5,5,5,5,5,5,5,0,10,0,5,5,5,0,5,10,10,10,0,0,10,5,5,10,10,5,10,5,0,10,0,10,0,5,10,5,5,5,5,5,10,10,5,10,5]
{"$rows_left_out":44}
{"sheet":"November","index":4,"n_rows":61,"n_cols":107,"rows_kept":61,"cut":false,"hidden":false,"merged":[[1,1,1,4]]}
[null,null,null,null,null,null,null,"Aaron Nealon","Aidan Scanlon","Aidan White","Alain Verjans","Anastas Popov","Andy Dunne","Benny McCarthy","Billy McGinley","Bobby Hynes","Brendan Maguire","Brian Haughton","Brian Hearne","Brian Mullen","Calvin McGettigan","Caoimhin McEnteggart","Carl Toner","Caroline Carroll","Chris Keohan","Christina Morgan","Ciaran O'Hart","Colin Butterly","Con McSweeney","Craig Calvert","Craig Whelan","Daniel Dorrian","Darragh Kenny","Darren O'Gorman","Dave Lavelle","Dave McGinley","David Cooney","David Doyle","David King","Derek McDonald","Dylan Delaney","Dylan O'Riordan","Eamon Fox","Eamonn Gallagher","Eoghan Farrelly","Finbarr Corkery","Frank McSweeney","Gareth Pierpoint","Gary Donnelly","Gary Fitzpatrick","Gavin Goodwin","Gavin Morgan","Gerry Draper","Gerry Moore","Graham Pierpoint","Greg Donaghy","Helen Fadian","Jack Draper","Jason Maloney","Javier Suarez","Jim Foley","Jimmy Maguire","Joe Behan","Joe Turner","John Brophy","John Cafferkey","Johno Percy","Jonathan Fox","Joseph Kavanagh","Joseph Leppla","Keith Nerney","Keith Ryan","Kev Dalton","Kevin Lawless","Kevin Nolan","Kieran Killeen","Liam Keohan","Lionel Knott","Martin Kimmins","Micheal Joyce","Micheal Munnelly","Monica Collins","Niall Carroll","Paddy Devereux","Paul Foley","Paul Moore","Paul Prendergast","Peter Lavelle","Phil Doyle","Philip Jordan","Phoebe Suarez Behan","Realtin Dunne","Rhea Suarez Behan","Richard Johnston","Robert Foley","Robert Gaffney","Roisin Joyce","Sam Calvert","Sean Cafferkey","Sean Cleary","Sean O'Mairtin","Shane Horan","Simon Scanlon","Thomas Nolan","Tommy Hamill","Tommy Tormey","Tommy Walsh"]
["Date","Teams",null,null,null,"Time"]
["2025-11-01","Brighton",3,0,"Leeds Utd",45962.625,null,5,5,0,5,5,5,5,10,5,5,5,0,5,"-",0,5,5,5,5,5,0,5,5,0,5,5,5,"-",5,5,5,5,5,0,5,5,5,0,5,5,5,0,5,"-",5,5,5,5,5,5,0,5,5,10,0,5,5,5,5,5,5,5,5,5,0,5,5,5,5,5,5,5,0,5,5,0,0,5,5,5,5,5,5,5,5,5,0,5,5,5,5,10,5,5,5,5,5,5,0,5]
["2025-11-01","Burnley",0,2,"Arsenal",45962.625,null,10,5,10,5,10,10,"-",5,10,10,5,10,5,"-",10,10,5,10,0,5,0,10,10,5,5,10,10,"-",5,5,10,0,5,5,5,10,10,10,10,10,10,5,0,"-",10,10,5,10,10,5,10,10,5,10,5,10,5,5,5,10,10,5,5,10,5,5,5,5,10,5,5,10,10,5,5,10,5,5,10,10,5,5,10,5,10,5,5,10,5,5,10,10,10,10,5,5,0,10,5,10]
["2025-11-01","Crystal Palace",2,0,"Brentford",45962.625,null,0,0,5,5,5,0,"-",5,5,5,0,5,0,"-",0,0,5,5,5,10,0,5,5,0,5,5,5,"-",0,5,5,5,0,0,0,5,5,0,0,0,10,5,5,"-",5,5,0,5,5,10,5,10,10,10,0,0,5,0,5,5,5,0,0,0,10,5,5,0,0,5,0,0,5,0,0,5,5,0,0,5,5,5,5,5,0,0,0,5,5,0,5,10,5,5,0,10,5,0,5,0]
["2025-11-01","Fulham",3,0,"Wolves",45962.625,null,5,0,5,5,5,5,"-",5,5,5,5,5,5,"-",0,5,5,5,5,0,0,5,5,5,5,5,5,"-",5,0,10,5,5,5,0,5,5,5,0,5,5,0,5,"-",5,5,5,5,5,5,5,5,0,5,5,5,5,5,5,0,5,5,5,5,5,5,0,0,5,5,5,0,0,0,5,5,0,10,5,5,5,5,5,5,10,0,5,5,5,5,5,5,5,5,5,5,5,5,5,5]
["2025-11-01","Nott'm Forest",2,2,"Man Utd",45962.625,null,0,0,0,5,0,0,"-",0,0,0,0,0,0,"-",0,0,0,5,0,0,5,5,0,0,5,5,0,"-",0,0,0,0,0,0,0,0,10,0,0,0,10,5,0,"-",5,0,0,5,0,0,0,0,10,0,0,0,0,0,0,0,0,5,0,0,0,0,0,0,0,0,0,0,5,0,0,5,0,10,0,5,0,0,0,0,5,0,0,0,5,0,0,0,0,10,5,0,0,5,0,5]
["2025-11-01","Spurs",0,1,"Chelsea","17:30:00",null,5,5,0,0,0,0,"-",0,0,5,0,0,0,"-",0,0,0,0,0,0,0,0,0,0,0,0,0,"-",0,5,0,0,0,0,5,0,0,5,0,0,0,0,0,"-",0,0,0,0,5,0,5,0,0,5,0,0,0,0,0,0,0,0,0,5,0,0,0,0,0,5,0,0,5,5,5,5,0,0,0,0,0,0,0,5,5,5,0,0,0,0,0,0,0,0,0,0,5,5,0,0]
{"$rows_left_out":54}
{"sheet":"December","index":5,"n_rows":81,"n_cols":107,"rows_kept":81,"cut":false,"hidden":false,"merged":[[1,1,1,4]]}
[null,null,null,null,null,null,null,"Aaron Nealon","Aidan Scanlon","Aidan White","Alain Verjans","Anastas Popov","Andy Dunne","Benny McCarthy","Billy McGinley","Bobby Hynes","Brendan Maguire","Brian Haughton","Brian Hearne","Brian Mullen","Calvin McGettigan","Caoimhin McEnteggart","Carl Toner","Caroline Carroll","Chris Keohan","Christina Morgan","Ciaran O'Hart","Colin Butterly","Con McSweeney","Craig Calvert","Craig Whelan","Daniel Dorrian","Darragh Kenny","Darren O'Gorman","Dave Lavelle","Dave McGinley","David Cooney","David Doyle","David King","Derek McDonald","Dylan Delaney","Dylan O'Riordan","Eamon Fox","Eamonn Gallagher","Eoghan Farrelly","Finbarr Corkery","Frank McSweeney","Gareth Pierpoint","Gary Donnelly","Gary Fitzpatrick","Gavin Goodwin","Gavin Morgan","Gerry Draper","Gerry Moore","Graham Pierpoint","Greg Donaghy","Helen Fadian","Jack Draper","Jason Maloney","Javier Suarez","Jim Foley","Jimmy Maguire","Joe Behan","Joe Turner","John Brophy","John Cafferkey","Johno Percy","Jonathan Fox","Joseph Kavanagh","Joseph Leppla","Keith Nerney","Keith Ryan","Kev Dalton","Kevin Lawless","Kevin Nolan","Kieran Killeen","Liam Keohan","Lionel Knott","Martin Kimmins","Micheal Joyce","Micheal Munnelly","Monica Collins","Niall Carroll","Paddy Devereux","Paul Foley","Paul Moore","Paul Prendergast","Peter Lavelle","Phil Doyle","Philip Jordan","Phoebe Suarez Behan","Realtin Dunne","Rhea Suarez Behan","Richard Johnston","Robert Foley","Robert Gaffney","Roisin Joyce","Sam Calvert","Sean Cafferkey","Sean Cleary","Sean O'Mairtin","Shane Horan","Simon Scanlon","Thomas Nolan","Tommy Hamill","Tommy Tormey","Tommy Walsh"]
["Date","Teams",null,null,null,"Time"]
["2025-12-02","Bournemouth",0,1,"Everton","19:30:00",null,0,5,0,0,0,0,"-",0,0,0,0,0,0,"-",0,0,0,0,0,0,"-",0,0,0,0,0,0,"-",0,0,5,"-",0,"-",0,0,0,0,0,0,0,0,0,"-",0,0,0,0,0,0,0,0,0,0,0,0,0,0,0,0,0,0,0,0,0,0,0,0,0,0,0,0,0,0,0,5,10,0,0,0,0,0,0,0,0,5,0,0,0,0,0,0,0,0,0,0,0,0,0,0]
["2025-12-02","Fulham",4,5,"Man City","19:30:00",null,5,5,5,5,5,0,"-",5,5,5,5,5,5,"-",5,5,0,5,0,5,"-",5,5,5,5,5,5,"-",5,5,5,"-",5,"-",0,5,5,5,5,5,5,0,5,"-",5,5,0,5,5,5,5,5,5,5,0,5,5,0,5,5,0,5,5,0,5,0,5,5,5,5,0,5,5,5,5,0,5,5,5,5,5,5,5,5,0,5,0,5,5,5,0,5,5,5,5,0,0,5,0,5]
["2025-12-02","Newcastle",2,2,"Spurs","20:15:00",null,0,0,5,5,0,0,"-",0,0,0,0,0,5,"-",10,0,0,0,0,5,"-",0,0,0,10,0,0,"-",0,0,0,"-",0,"-",0,0,0,0,0,0,0,0,0,"-",0,0,0,0,0,0,0,10,0,0,0,0,0,10,0,0,0,0,0,0,0,0,0,0,0,0,0,0,0,0,0,0,0,10,0,0,0,0,0,10,5,0,0,0,10,0,5,0,0,0,0,5,0,5,0,0]
["2025-12-03","Arsenal",2,0,"Brentford","19:30:00",null,5,0,5,5,10,5,"-",5,10,10,5,10,5,"-",5,10,5,5,5,10,"-",5,5,10,5,10,10,"-",10,5,5,"-",5,"-",5,5,10,0,5,5,5,5,5,"-",5,10,5,10,10,10,10,10,10,10,10,10,10,10,5,10,10,10,5,10,10,5,10,10,5,10,5,5,0,5,10,10,0,0,0,5,10,10,10,5,5,5,5,10,5,10,0,5,5,5,5,10,5,10,5,5]
["2025-12-03","Brighton",3,4,"Aston Villa","19:30:00",null,0,5,5,0,0,0,"-",0,0,0,0,0,0,"-",0,0,0,0,0,0,"-",0,0,0,0,5,0,"-",0,0,0,"-",0,"-",0,0,0,0,0,0,0,5,0,"-",0,0,0,0,0,5,0,0,0,0,0,0,0,0,0,0,5,0,0,5,0,0,0,0,0,5,0,0,0,0,0,0,5,0,0,0,0,5,0,5,0,0,0,0,0,0,0,0,0,0,0,0,5,0,0,0]
["2025-12-03","Burnley",0,1,"Crystal Palace","19:30:00",null,0,5,5,0,10,10,"-",5,0,0,5,5,10,"-",0,10,5,5,0,0,"-",5,5,5,5,5,0,"-",0,0,5,"-",5,"-",0,10,0,5,10,5,5,5,5,"-",10,5,0,5,5,0,5,5,5,5,0,0,0,0,5,5,10,5,5,10,0,5,10,5,5,10,5,0,5,5,0,0,10,5,0,5,5,5,10,0,0,5,0,5,0,0,0,0,5,5,5,5,10,10,0,5]
{"$rows_left_out":74}
{"sheet":"January","index":6,"n_rows":52,"n_cols":6,"rows_kept":52,"cut":false,"hidden":false,"merged":[[1,1,1,4]]}
[]
["Date","Teams",null,null,null,"Time"]
["2026-01-03","Aston Villa",null,null,"Nott'm Forest",46025.625]
["2026-01-03","Bournemouth",null,null,"Arsenal",46025.625]
["2026-01-03","Brighton",null,null,"Burnley",46025.625]
["2026-01-03","Everton",null,null,"Brentford",46025.625]
["2026-01-03","Fulham",null,null,"Liverpool",46025.625]
["2026-01-03","Leeds Utd",null,null,"Man Utd",46025.625]
{"$rows_left_out":45}
{"sheet":"February","index":7,"n_rows":42,"n_cols":6,"rows_kept":42,"cut":false,"hidden":false,"merged":[[1,1,1,4]]}
[]
["Date","Teams",null,null,null,"Time"]
["2026-02-07","Arsenal",null,null,"Sunderland",46060.625]
["2026-02-07","Bournemouth",null,null,"Aston Villa",46060.625]
["2026-02-07","Brighton",null,null,"Crystal Palace",46060.625]
["2026-02-07","Burnley",null,null,"West Ham",46060.625]
["2026-02-07","Fulham",null,null,"Everton",46060.625]
["2026-02-07","Leeds Utd",null,null,"Nott'm Forest",46060.625]
{"$rows_left_out":35}
{"sheet":"March","index":8,"n_rows":32,"n_cols":6,"rows_kept":32,"cut":false,"hidden":false,"merged":[[1,1,1,4]]}
[]
["Date","Teams",null,null,null,"Time"]
["2026-03-04","Aston Villa",null,null,"Chelsea",46085.833333333336]
["2026-03-04","Bournemouth",null,null,"Brentford",46085.833333333336]
["2026-03-04","Brighton",null,null,"Arsenal",46085.833333333336]
["2026-03-04","Everton",null,null,"Burnley",46085.833333333336]
["2026-03-04","Fulham",null,null,"West Ham",46085.833333333336]
["2026-03-04","Leeds Utd",null,null,"Sunderland",46085.833333333336]
{"$rows_left_out":25}
{"sheet":"April","index":9,"n_rows":32,"n_cols":6,"rows_kept":32,"cut":false,"hidden":false,"merged":[[1,1,1,4]]}
[]
["Date","Teams",null,null,null,"Time"]
["2026-04-11","Arsenal",null,null,"Bournemouth",46123.625]
["2026-04-11","Brentford",null,null,"Everton",46123.625]
["2026-04-11","Burnley",null,null,"Brighton",46123.625]
["2026-04-11","Chelsea",null,null,"Man City",46123.625]
["2026-04-11","Crystal Palace",null,null,"Newcastle",46123.625]
["2026-04-11","Liverpool",null,null,"Fulham",46123.625]
{"$rows_left_out":25}
{"sheet":"May","index":10,"n_rows":42,"n_cols":6,"rows_kept":42,"cut":false,"hidden":false,"merged":[[1,1,1,4]]}
[]
["Date","Teams",null,null,null,"Time"]
["2026-05-02","Arsenal",null,null,"Fulham",46144.625]
["2026-05-02","Aston Villa",null,null,"Spurs",46144.625]
["2026-05-02","Bournemouth",null,null,"Crystal Palace",46144.625]
["2026-05-02","Brentford",null,null,"West Ham",46144.625]
["2026-05-02","Chelsea",null,null,"Nott'm Forest",46144.625]
["2026-05-02","Everton",null,null,"Man City",46144.625]
{"$rows_left_out":35}
{"sheet":"Jokers","index":11,"n_rows":101,"n_cols":35,"rows_kept":101,"cut":false,"hidden":false,"merged":[]}
["No.","Player","Team Name","Joker",1,2,3,4,5,6,7,8,9,10,11,12,13,14,15,16,17,18,19,20,21,22,23,24,25,26,27,28,29,30,"Total"]
[1,"Aaron Nealon","Backstreet Moyes",null,null,null,null,null,null,null,null,null,null,null,null,null,null,null,null,null,null,null,null,null,null,null,null,null,null,null,null,null,null,null,{"$f":"COUNTIF(E2:AH2,\"a\")","v":0}]
[2,"Aidan Scanlon","St Pats",null,null,null,null,null,null,null,null,null,null,null,null,null,null,null,null,null,null,null,null,null,null,null,null,null,null,null,null,null,null,null,0]
[3,"Aidan White","The Emery Board","1-0","a",null,null,null,null,null,null,null,null,null,null,null,null,null,null,null,null,null,null,null,null,null,null,null,null,null,null,null,null,null,1]
[4,"Alain Verjans","TheCoysAreBackInTown",null,null,null,null,null,null,null,null,null,null,null,null,null,null,null,null,null,null,null,null,null,null,null,null,null,null,null,null,null,null,null,0]
[5,"Anastas Popov","Golden State Saints","1-0","a","a","a",null,null,null,null,null,null,null,null,null,null,null,null,null,null,null,null,null,null,null,null,null,null,null,null,null,null,null,3]
[6,"Andy Dunne","Escape To Victory FC",null,null,null,null,null,null,null,null,null,null,null,null,null,null,null,null,null,null,null,null,null,null,null,null,null,null,null,null,null,null,null,0]
[7,"Benny McCarthy","Brendan's Navigators","2-1","a","a","a","a","a","a","a","a","a","a","a","a","a","a","a","a","a","a","a","a","a","a","a","a","a","a","a","a","a","a",30]
{"$rows_left_out":93}